Reaction Details
TargetIntegrin alpha-L
LigandBDBM79603
Substrate/Competitorn/a
Meas. Tech.Dose Response of Developing T Cell Immune Modulators with powder sourced compounds
EC50 299±n/a nM
Citation PubChem, PC Dose Response of Developing T Cell Immune Modulators with powder sourced compounds PubChem Bioassay(2011)[AID]
 
Integrin alpha-L
Name:Integrin alpha-L
Type:Enzyme Catalytic Domain
Mol. Mass.:128317.79
Organism:Mus musculus
Description:P24063
Residue:1162
BDBM79603
NameBDBM79603
Synonyms:(3-chloranyl-6-fluoranyl-1-benzothiophen-2-yl)-(3,5-dimethylpyrazol-1-yl)methanone (3-chloro-6-fluoro-1-benzothiophen-2-yl)-(3,5-dimethylpyrazol-1-yl)methanone VU0284248-2 | cid_2948628
TypeSmall organic molecule
Emp. Form.C14H10ClFN2OS
Mol. Mass.308.758
SMILESCc1cc(C)n(n1)C(=O)c1sc2cc(F)ccc2c1Cl