Reaction Details
TargetIntegrin alpha-L
LigandBDBM79604
Substrate/Competitorn/a
Meas. Tech.Dose Response of Developing T Cell Immune Modulators with powder sourced compounds
EC50 17061±n/a nM
Citation PubChem, PC Dose Response of Developing T Cell Immune Modulators with powder sourced compounds PubChem Bioassay(2011)[AID]
 
Integrin alpha-L
Name:Integrin alpha-L
Type:Enzyme Catalytic Domain
Mol. Mass.:128317.79
Organism:Mus musculus
Description:P24063
Residue:1162
BDBM79604
NameBDBM79604
Synonyms:2-[3-(2-bromanyl-6-chloranyl-4-methyl-phenoxy)propylsulfanyl]-6-methyl-1H-pyrimidin-4-one 2-[3-(2-bromo-6-chloro-4-methylphenoxy)propylsulfanyl]-6-methyl-1H-pyrimidin-4-one VU0170460-3 | cid_2216015
TypeSmall organic molecule
Emp. Form.C15H16BrClN2O2S
Mol. Mass.403.722
SMILESCc1cc(Cl)c(OCCCSc2nc(C)cc(=O)[nH]2)c(Br)c1