Reaction Details
TargetIntegrin alpha-L
LigandBDBM79605
Substrate/Competitorn/a
Meas. Tech.Dose Response of Developing T Cell Immune Modulators with powder sourced compounds
EC50 40±n/a nM
Citation PubChem, PC Dose Response of Developing T Cell Immune Modulators with powder sourced compounds PubChem Bioassay(2011)[AID]
 
Integrin alpha-L
Name:Integrin alpha-L
Type:Enzyme Catalytic Domain
Mol. Mass.:128317.79
Organism:Mus musculus
Description:P24063
Residue:1162
BDBM79605
NameBDBM79605
Synonyms:N-(4-acetylphenyl)-1-(4-methoxyphenyl)sulfonyl-2-pyrrolidinecarboxamide N-(4-acetylphenyl)-1-(4-methoxyphenyl)sulfonylpyrrolidine-2-carboxamide VU0424119-1 | cid_5195263
TypeSmall organic molecule
Emp. Form.C20H22N2O5S
Mol. Mass.402.464
SMILESCOc1ccc(cc1)S(=O)(=O)N1CCCC1C(=O)Nc1ccc(cc1)C(C)=O