Reaction Details
TargetIntegrin alpha-L
LigandBDBM79606
Substrate/Competitorn/a
Meas. Tech.Dose Response of Developing T Cell Immune Modulators with powder sourced compounds
EC50 51880±n/a nM
Citation PubChem, PC Dose Response of Developing T Cell Immune Modulators with powder sourced compounds PubChem Bioassay(2011)[AID]
 
Integrin alpha-L
Name:Integrin alpha-L
Type:Enzyme Catalytic Domain
Mol. Mass.:128317.79
Organism:Mus musculus
Description:P24063
Residue:1162
BDBM79606
NameBDBM79606
Synonyms:4-[[2-[(7-chloranyl-4-oxidanylidene-pyrido[1,2-a]pyrimidin-2-yl)methylsulfanyl]-4-oxidanylidene-thieno[3,2-d]pyrimidin-3-yl]methyl]cyclohexane-1-carboxylic acid 4-[[2-[(7-chloro-4-oxo-2-pyrido[1,2-a]pyrimidinyl)methylthio]-4-oxo-3-thieno[3,2-d]pyrimidinyl]methyl]-1-cyclohexanecarboxylic acid VU0146817-3 | cid_4170435
TypeSmall organic molecule
Emp. Form.C23H21ClN4O4S2
Mol. Mass.517.02
SMILESOC(=O)C1CCC(Cn2c(SCc3cc(=O)n4cc(Cl)ccc4n3)nc3ccsc3c2=O)CC1