Reaction Details
TargetIntegrin alpha-L
LigandBDBM79608
Substrate/Competitorn/a
Meas. Tech.Dose Response of Developing T Cell Immune Modulators with powder sourced compounds
EC50 246±n/a nM
Citation PubChem, PC Dose Response of Developing T Cell Immune Modulators with powder sourced compounds PubChem Bioassay(2011)[AID]
 
Integrin alpha-L
Name:Integrin alpha-L
Type:Enzyme Catalytic Domain
Mol. Mass.:128317.79
Organism:Mus musculus
Description:P24063
Residue:1162
BDBM79608
NameBDBM79608
Synonyms:N-[4-[4-(1H-benzimidazol-2-yl)piperidin-1-yl]sulfonylphenyl]-2-ethoxy-ethanamide N-[4-[4-(1H-benzimidazol-2-yl)piperidino]sulfonylphenyl]-2-ethoxy-acetamide VU0424130-1 | cid_18575337
TypeSmall organic molecule
Emp. Form.C22H26N4O4S
Mol. Mass.442.531
SMILESCCOCC(=O)Nc1ccc(cc1)S(=O)(=O)N1CCC(CC1)c1nc2ccccc2[nH]1