Reaction Details
TargetIntegrin alpha-L
LigandBDBM79610
Substrate/Competitorn/a
Meas. Tech.Dose Response of Developing T Cell Immune Modulators with powder sourced compounds
EC50 11015±n/a nM
Citation PubChem, PC Dose Response of Developing T Cell Immune Modulators with powder sourced compounds PubChem Bioassay(2011)[AID]
 
Integrin alpha-L
Name:Integrin alpha-L
Type:Enzyme Catalytic Domain
Mol. Mass.:128317.79
Organism:Mus musculus
Description:P24063
Residue:1162
BDBM79610
NameBDBM79610
Synonyms:4-(4-cyclopentylpiperazino)sulfonylbenzoic acid ethyl ester VU0308339-2 ethyl 4-(4-cyclopentylpiperazin-1-yl)sulfonylbenzoate
TypeSmall organic molecule
Emp. Form.C18H26N2O4S
Mol. Mass.366.475
SMILESCCOC(=O)c1ccc(cc1)S(=O)(=O)N1CCN(CC1)C1CCCC1