Reaction Details
TargetIntegrin alpha-L
LigandBDBM79613
Substrate/Competitorn/a
Meas. Tech.Dose Response of Developing T Cell Immune Modulators with powder sourced compounds
EC50 24717±n/a nM
Citation PubChem, PC Dose Response of Developing T Cell Immune Modulators with powder sourced compounds PubChem Bioassay(2011)[AID]
 
Integrin alpha-L
Name:Integrin alpha-L
Type:Enzyme Catalytic Domain
Mol. Mass.:128317.79
Organism:Mus musculus
Description:P24063
Residue:1162
BDBM79613
NameBDBM79613
Synonyms:3-(methoxymethyl)-N-(3-piperidin-1-ylsulfonylphenyl)-1-benzofuran-2-carboxamide 3-(methoxymethyl)-N-[3-(1-piperidinylsulfonyl)phenyl]-2-benzofurancarboxamide cid_4316625
TypeSmall organic molecule
Emp. Form.C22H24N2O5S
Mol. Mass.428.501
SMILESCOCc1c(oc2ccccc12)C(=O)Nc1cccc(c1)S(=O)(=O)N1CCCCC1