Reaction Details
TargetIntegrin alpha-L
LigandBDBM79614
Substrate/Competitorn/a
Meas. Tech.Dose Response of Developing T Cell Immune Modulators with powder sourced compounds
EC50 20137±n/a nM
Citation PubChem, PC Dose Response of Developing T Cell Immune Modulators with powder sourced compounds PubChem Bioassay(2011)[AID]
 
Integrin alpha-L
Name:Integrin alpha-L
Type:Enzyme Catalytic Domain
Mol. Mass.:128317.79
Organism:Mus musculus
Description:P24063
Residue:1162
BDBM79614
NameBDBM79614
Synonyms:4-chloranyl-N-(cyclohexylmethyl)-3-morpholin-4-ylsulfonyl-benzamide 4-chloro-N-(cyclohexylmethyl)-3-morpholin-4-ylsulfonylbenzamide VU0424154-1 | cid_2128353
TypeSmall organic molecule
Emp. Form.C18H25ClN2O4S
Mol. Mass.400.92
SMILESClc1ccc(cc1S(=O)(=O)N1CCOCC1)C(=O)NCC1CCCCC1