Reaction Details
TargetIntegrin alpha-L
LigandBDBM79616
Substrate/Competitorn/a
Meas. Tech.Dose Response of Developing T Cell Immune Modulators with powder sourced compounds
EC50 197±n/a nM
Citation PubChem, PC Dose Response of Developing T Cell Immune Modulators with powder sourced compounds PubChem Bioassay(2011)[AID]
 
Integrin alpha-L
Name:Integrin alpha-L
Type:Enzyme Catalytic Domain
Mol. Mass.:128317.79
Organism:Mus musculus
Description:P24063
Residue:1162
BDBM79616
NameBDBM79616
Synonyms:2-[1,3-benzodioxol-5-ylmethyl(methyl)amino]-N-(2-chloranyl-5-pyrrolidin-1-ylsulfonyl-phenyl)ethanamide 2-[1,3-benzodioxol-5-ylmethyl(methyl)amino]-N-[2-chloro-5-(1-pyrrolidinylsulfonyl)phenyl]acetamide VU0424162-1 | cid_16329116
TypeSmall organic molecule
Emp. Form.C21H24ClN3O5S
Mol. Mass.465.95
SMILESCN(CC(=O)Nc1cc(ccc1Cl)S(=O)(=O)N1CCCC1)Cc1ccc2OCOc2c1