Reaction Details
TargetBcl-2-related protein A1
LigandBDBM41228
Substrate/Competitorn/a
Meas. Tech.Dose Response confirmation of UBC13 Polyubiquitin Inhibitors using a Bfl-1 counterscreen
IC50 360±24 nM
Citation PubChem, PC Dose Response confirmation of UBC13 Polyubiquitin Inhibitors using a Bfl-1 counterscreen PubChem Bioassay(2011)[AID]
 
Bcl-2-related protein A1
Name:Bcl-2-related protein A1
Type:Apoptosis regulator protein
Mol. Mass.:19909.74
Organism:Mus musculus (Mouse)
Description:gi_11024684
Residue:172
BDBM41228
NameBDBM41228
Synonyms:2,3,5,6-tetrakis(2-furanyl)pyrazine 2,3,5,6-tetrakis(furan-2-yl)pyrazine SMR000065994 | cid_854635
TypeSmall organic molecule
Emp. Form.C20H12N2O4
Mol. Mass.344.3203
SMILESc1coc(c1)-c1nc(-c2ccco2)c(nc1-c1ccco1)-c1ccco1