Reaction Details
TargetBcl-2-related protein A1
LigandBDBM78578
Substrate/Competitorn/a
Meas. Tech.Dose Response confirmation of UBC13 Polyubiquitin Inhibitors using a Bfl-1 counterscreen
IC50 3320±239 nM
Citation PubChem, PC Dose Response confirmation of UBC13 Polyubiquitin Inhibitors using a Bfl-1 counterscreen PubChem Bioassay(2011)[AID]
 
Bcl-2-related protein A1
Name:Bcl-2-related protein A1
Type:Apoptosis regulator protein
Mol. Mass.:19909.74
Organism:Mus musculus (Mouse)
Description:gi_11024684
Residue:172
BDBM78578
NameBDBM78578
Synonyms:(E)-3-[3-[(2-bromanyl-4-chloranyl-phenoxy)methyl]-4-methoxy-phenyl]-N-(1,3,5-trimethylpyrazol-4-yl)prop-2-enamide (E)-3-[3-[(2-bromo-4-chlorophenoxy)methyl]-4-methoxyphenyl]-N-(1,3,5-trimethyl-4-pyrazolyl)-2-propenamide 3-{3-[(2-bromo-4-chlorophenoxy)methyl]-4-methoxyphenyl}-N-(1,3,5-trimethyl-1H-pyrazol-4-yl)acrylamide SMR000115070 | cid_5430631
TypeSmall organic molecule
Emp. Form.C23H23BrClN3O3
Mol. Mass.504.804
SMILESCOc1ccc(\C=C\C(=O)Nc2c(C)nn(C)c2C)cc1COc1ccc(Cl)cc1Br