Reaction Details
TargetBcl-2-related protein A1
LigandBDBM78848
Substrate/Competitorn/a
Meas. Tech.Dose Response confirmation of UBC13 Polyubiquitin Inhibitors using a Bfl-1 counterscreen
IC50>20000±0 nM
Citation PubChem, PC Dose Response confirmation of UBC13 Polyubiquitin Inhibitors using a Bfl-1 counterscreen PubChem Bioassay(2011)[AID]
 
Bcl-2-related protein A1
Name:Bcl-2-related protein A1
Type:Apoptosis regulator protein
Mol. Mass.:19909.74
Organism:Mus musculus (Mouse)
Description:gi_11024684
Residue:172
BDBM78848
NameBDBM78848
Synonyms:IK-LW SMR000391070 | cid_16196648
TypeSmall organic molecule
Emp. Form.C51H79ClN18O5
Mol. Mass.1059.744
SMILESCl.CCC(C)[C@H](N)c1cn(nn1)[C@@H](CCCCN)C(=O)N1CCN(CC1)c1nc(NCCOCCOCCOCC#C)nc(n1)N1CCN(CC1)C(=O)[C@H](Cc1cc2ccccc2[nH]1)n1cc(nn1)[C@@H](N)CC(C)C