Reaction Details
TargetBcl-2-related protein A1
LigandBDBM51882
Substrate/Competitorn/a
Meas. Tech.Dose Response confirmation of UBC13 Polyubiquitin Inhibitors using a Bfl-1 counterscreen
IC50 3440±157 nM
Citation PubChem, PC Dose Response confirmation of UBC13 Polyubiquitin Inhibitors using a Bfl-1 counterscreen PubChem Bioassay(2011)[AID]
 
Bcl-2-related protein A1
Name:Bcl-2-related protein A1
Type:Apoptosis regulator protein
Mol. Mass.:19909.74
Organism:Mus musculus (Mouse)
Description:gi_11024684
Residue:172
BDBM51882
NameBDBM51882
Synonyms:2-(diethylamino)ethyl 4-[[(Z)-2-cyano-2-[4-(3,4-dimethoxyphenyl)-1,3-thiazol-2-yl]ethenyl]amino]benzoate 4-[[(Z)-2-cyano-2-[4-(3,4-dimethoxyphenyl)thiazol-2-yl]vinyl]amino]benzoic acid 2-(diethylamino)ethyl ester MLS000769345 cid_16682517
TypeSmall organic molecule
Emp. Form.C27H30N4O4S
Mol. Mass.506.617
SMILESCCN(CC)CCOC(=O)c1ccc(cc1)N=CC(C#N)c1nc(cs1)-c1ccc(OC)c(OC)c1