Reaction Details
TargetBcl-2-related protein A1
LigandBDBM51883
Substrate/Competitorn/a
Meas. Tech.Dose Response confirmation of UBC13 Polyubiquitin Inhibitors using a Bfl-1 counterscreen
IC50 1720±39 nM
Citation PubChem, PC Dose Response confirmation of UBC13 Polyubiquitin Inhibitors using a Bfl-1 counterscreen PubChem Bioassay(2011)[AID]
 
Bcl-2-related protein A1
Name:Bcl-2-related protein A1
Type:Apoptosis regulator protein
Mol. Mass.:19909.74
Organism:Mus musculus (Mouse)
Description:gi_11024684
Residue:172
BDBM51883
NameBDBM51883
Synonyms:2-(diethylamino)ethyl 4-[[(Z)-2-[4-(1,3-benzodioxol-5-yl)-1,3-thiazol-2-yl]-2-cyano-ethenyl]amino]benzoate 4-[(Z)-2-(4-Benzo[1,3]dioxol-5-yl-thiazol-2-yl)-2-cyano-vinylamino]-benzoic acid 2-diethylamino-ethyl ester 4-[[(Z)-2-[4-(1,3-benzodioxol-5-yl)thiazol-2-yl]-2-cyano-vinyl]amino]benzoic acid 2-(diethylamino)ethyl ester SMR000434080 | cid_1838764
TypeSmall organic molecule
Emp. Form.C26H26N4O4S
Mol. Mass.490.574
SMILESCCN(CC)CCOC(=O)c1ccc(cc1)N=CC(C#N)c1nc(cs1)-c1ccc2OCOc2c1