Reaction Details
TargetBcl-2-related protein A1
LigandBDBM51885
Substrate/Competitorn/a
Meas. Tech.Dose Response confirmation of UBC13 Polyubiquitin Inhibitors using a Bfl-1 counterscreen
IC50 4880±98 nM
Citation PubChem, PC Dose Response confirmation of UBC13 Polyubiquitin Inhibitors using a Bfl-1 counterscreen PubChem Bioassay(2011)[AID]
 
Bcl-2-related protein A1
Name:Bcl-2-related protein A1
Type:Apoptosis regulator protein
Mol. Mass.:19909.74
Organism:Mus musculus (Mouse)
Description:gi_11024684
Residue:172
BDBM51885
NameBDBM51885
Synonyms:1-N,4-N-bis[4-(4,5-dihydro-1H-imidazol-2-yl)phenyl]-2-nitrobenzene-1,4-dicarboxamide N,N'-bis[4-(2-imidazolin-2-yl)phenyl]-2-nitro-terephthalamide N1,N4-bis[4-(4,5-dihydro-1H-imidazol-2-yl)phenyl]-2-nitrobenzene-1,4-dicarboxamide cid_165308
TypeSmall organic molecule
Emp. Form.C26H23N7O4
Mol. Mass.497.5053
SMILES[O-][N+](=O)c1cc(ccc1C(=O)Nc1ccc(cc1)C1=[NH+]CC[N-]1)C(=O)Nc1ccc(cc1)C1=[NH+]CC[N-]1