Reaction Details
TargetBcl-2-related protein A1
LigandBDBM53484
Substrate/Competitorn/a
Meas. Tech.Dose Response confirmation of UBC13 Polyubiquitin Inhibitors using a Bfl-1 counterscreen
IC50 13200±230 nM
Citation PubChem, PC Dose Response confirmation of UBC13 Polyubiquitin Inhibitors using a Bfl-1 counterscreen PubChem Bioassay(2011)[AID]
 
Bcl-2-related protein A1
Name:Bcl-2-related protein A1
Type:Apoptosis regulator protein
Mol. Mass.:19909.74
Organism:Mus musculus (Mouse)
Description:gi_11024684
Residue:172
BDBM53484
NameBDBM53484
Synonyms:6-Benzothiazol-2-yl-1-ethyl-2-[2-(methyl-phenyl-amino)-vinyl]-3-phenyl-3H-benzoimidazol-1-ium N-[(E)-2-[5-(1,3-benzothiazol-2-yl)-3-ethyl-1-phenyl-2-benzimidazol-3-iumyl]ethenyl]-N-methylaniline;iodide N-[(E)-2-[5-(1,3-benzothiazol-2-yl)-3-ethyl-1-phenylbenzimidazol-3-ium-2-yl]ethenyl]-N-methylaniline;iodide SMR000504738 cid_5719375
TypeSmall organic molecule
Emp. Form.C31H27N4S
Mol. Mass.487.637
SMILESCC[n+]1c(\C=C\N(C)c2ccccc2)n(-c2ccccc2)c2ccc(cc12)-c1nc2ccccc2s1