Reaction Details
TargetBcl-2-related protein A1
LigandBDBM64465
Substrate/Competitorn/a
Meas. Tech.Dose Response confirmation of UBC13 Polyubiquitin Inhibitors using a Bfl-1 counterscreen
IC50 8510±503 nM
Citation PubChem, PC Dose Response confirmation of UBC13 Polyubiquitin Inhibitors using a Bfl-1 counterscreen PubChem Bioassay(2011)[AID]
 
Bcl-2-related protein A1
Name:Bcl-2-related protein A1
Type:Apoptosis regulator protein
Mol. Mass.:19909.74
Organism:Mus musculus (Mouse)
Description:gi_11024684
Residue:172
BDBM64465
NameBDBM64465
Synonyms:4-(3,4-dihydro-1H-isoquinolin-2-ylsulfonyl)-N-(4,7-dimethoxy-1,3-benzothiazol-2-yl)-N-[3-(dimethylamino)propyl]benzamide;hydrochloride SMR000807899 | cid_24892212
TypeSmall organic molecule
Emp. Form.C30H34N4O5S2
Mol. Mass.594.745
SMILESCOc1ccc(OC)c2sc(nc12)N(CCCN(C)C)C(=O)c1ccc(cc1)S(=O)(=O)N1CCc2ccccc2C1