Reaction Details
TargetTropomyosin alpha-1 chain
LigandBDBM79638
Substrate/Competitorn/a
Meas. Tech.Fluorescence-based biochemical high throughput dose response assay for activators of the calcium sensitivity of cardiac Regulated Thin Filaments (RTF)
EC50>71485±n/a nM
Citation PubChem, PC Fluorescence-based biochemical high throughput dose response assay for activators of the calcium sensitivity of cardiac Regulated Thin Filaments (RTF) PubChem Bioassay(2011)[AID]
 
Tropomyosin alpha-1 chain
Name:Tropomyosin alpha-1 chain
Type:Enzyme Catalytic Domain
Mol. Mass.:32681.01
Organism:Sus scrofa
Description:P42639
Residue:284
BDBM79638
NameBDBM79638
Synonyms:1-(3-Chloro-phenyl)-3-[4-(morpholine-4-carbonyl)-phenyl]-urea 1-(3-chlorophenyl)-3-[4-(morpholine-4-carbonyl)phenyl]urea MLS000070447 cid_650428
TypeSmall organic molecule
Emp. Form.C18H18ClN3O3
Mol. Mass.359.807
SMILESClc1cccc(NC(=O)Nc2ccc(cc2)C(=O)N2CCOCC2)c1