Reaction Details
TargetTropomyosin alpha-1 chain
LigandBDBM79644
Substrate/Competitorn/a
Meas. Tech.Fluorescence-based biochemical high throughput dose response assay for activators of the calcium sensitivity of cardiac Regulated Thin Filaments (RTF)
EC50>23829±n/a nM
Citation PubChem, PC Fluorescence-based biochemical high throughput dose response assay for activators of the calcium sensitivity of cardiac Regulated Thin Filaments (RTF) PubChem Bioassay(2011)[AID]
 
Tropomyosin alpha-1 chain
Name:Tropomyosin alpha-1 chain
Type:Enzyme Catalytic Domain
Mol. Mass.:32681.01
Organism:Sus scrofa
Description:P42639
Residue:284
BDBM79644
NameBDBM79644
Synonyms:6-amino-1-benzyl-5-[2-(3,4-dihydro-2H-quinolin-1-yl)acetyl]-3-ethyl-pyrimidine-2,4-quinone 6-amino-5-[2-(3,4-dihydro-2H-quinolin-1-yl)-1-oxoethyl]-3-ethyl-1-(phenylmethyl)pyrimidine-2,4-dione MLS000057510 cid_2089985
TypeSmall organic molecule
Emp. Form.C24H26N4O3
Mol. Mass.418.4882
SMILESCCn1c(=O)c(C(=O)CN2CCCc3ccccc23)c(N)n(Cc2ccccc2)c1=O