Reaction Details
TargetTropomyosin alpha-1 chain
LigandBDBM40036
Substrate/Competitorn/a
Meas. Tech.Fluorescence-based biochemical high throughput dose response assay for activators of the calcium sensitivity of cardiac Regulated Thin Filaments (RTF)
EC50 11632±n/a nM
Citation PubChem, PC Fluorescence-based biochemical high throughput dose response assay for activators of the calcium sensitivity of cardiac Regulated Thin Filaments (RTF) PubChem Bioassay(2011)[AID]
 
Tropomyosin alpha-1 chain
Name:Tropomyosin alpha-1 chain
Type:Enzyme Catalytic Domain
Mol. Mass.:32681.01
Organism:Sus scrofa
Description:P42639
Residue:284
BDBM40036
NameBDBM40036
Synonyms:MLS000094596 N-[4-[[(Z)-[2-(4-methylphenyl)-5-oxidanylidene-1,3-oxazol-4-ylidene]methyl]amino]phenyl]ethanamide N-[4-[[(Z)-[2-(4-methylphenyl)-5-oxo-4-oxazolylidene]methyl]amino]phenyl]acetamide SMR000030149 | cid_5771420
TypeSmall organic molecule
Emp. Form.C19H17N3O3
Mol. Mass.335.3566
SMILESCC(=O)Nc1ccc(cc1)N=Cc1nc(oc1O)-c1ccc(C)cc1