Reaction Details
TargetTropomyosin alpha-1 chain
LigandBDBM10759
Substrate/Competitorn/a
Meas. Tech.Fluorescence-based biochemical high throughput dose response assay for activators of the calcium sensitivity of cardiac Regulated Thin Filaments (RTF)
EC50>71402±n/a nM
Citation PubChem, PC Fluorescence-based biochemical high throughput dose response assay for activators of the calcium sensitivity of cardiac Regulated Thin Filaments (RTF) PubChem Bioassay(2011)[AID]
 
Tropomyosin alpha-1 chain
Name:Tropomyosin alpha-1 chain
Type:Enzyme Catalytic Domain
Mol. Mass.:32681.01
Organism:Sus scrofa
Description:P42639
Residue:284
BDBM10759
NameBDBM10759
Synonyms:2-acetoxyethyl(trimethyl)ammonium;bromide CHEMBL667 [2-(acetyloxy)ethyl]trimethylazanium acetylcholine chloride | cid_6060
TypeSmall Organic Molecule
Emp. Form.C7H16NO2
Mol. Mass.146.2069
SMILESCC(=O)OCC[N+](C)(C)C