Reaction Details
TargetTropomyosin alpha-1 chain
LigandBDBM52242
Substrate/Competitorn/a
Meas. Tech.Fluorescence-based biochemical high throughput dose response assay for activators of the calcium sensitivity of cardiac Regulated Thin Filaments (RTF)
EC50 2218±n/a nM
Citation PubChem, PC Fluorescence-based biochemical high throughput dose response assay for activators of the calcium sensitivity of cardiac Regulated Thin Filaments (RTF) PubChem Bioassay(2011)[AID]
 
Tropomyosin alpha-1 chain
Name:Tropomyosin alpha-1 chain
Type:Enzyme Catalytic Domain
Mol. Mass.:32681.01
Organism:Sus scrofa
Description:P42639
Residue:284
BDBM52242
NameBDBM52242
Synonyms:(5E)-5-[[5-(1-azepanyl)-2-furanyl]methylidene]-1-methyl-2-sulfanylidene-1,3-diazinane-4,6-dione (5E)-5-[[5-(azepan-1-yl)furan-2-yl]methylidene]-1-methyl-2-sulfanylidene-1,3-diazinane-4,6-dione MLS000594435 cid_1740011
TypeSmall organic molecule
Emp. Form.C16H19N3O3S
Mol. Mass.333.405
SMILESCN1C(=S)NC(=O)\C(=C/c2ccc(o2)N2CCCCCC2)C1=O