Reaction Details
TargetTropomyosin alpha-1 chain
LigandBDBM79661
Substrate/Competitorn/a
Meas. Tech.Fluorescence-based biochemical high throughput dose response assay for activators of the calcium sensitivity of cardiac Regulated Thin Filaments (RTF)
EC50 615.36±n/a nM
Citation PubChem, PC Fluorescence-based biochemical high throughput dose response assay for activators of the calcium sensitivity of cardiac Regulated Thin Filaments (RTF) PubChem Bioassay(2011)[AID]
 
Tropomyosin alpha-1 chain
Name:Tropomyosin alpha-1 chain
Type:Enzyme Catalytic Domain
Mol. Mass.:32681.01
Organism:Sus scrofa
Description:P42639
Residue:284
BDBM79661
NameBDBM79661
Synonyms:(Z)-3-(5-Phenyl-furan-2-yl)-2-(4-thiophen-2-yl-thiazol-2-yl)-acrylonitrile (Z)-3-(5-phenyl-2-furyl)-2-[4-(2-thienyl)thiazol-2-yl]acrylonitrile MLS000554395 cid_7308510
TypeSmall organic molecule
Emp. Form.C20H12N2OS2
Mol. Mass.360.452
SMILESN#C\C(=C\c1ccc(o1)-c1ccccc1)c1nc(cs1)-c1cccs1