Reaction Details
TargetTropomyosin alpha-1 chain
LigandBDBM43688
Substrate/Competitorn/a
Meas. Tech.Fluorescence-based biochemical high throughput dose response assay for activators of the calcium sensitivity of cardiac Regulated Thin Filaments (RTF)
EC50 500.48±n/a nM
Citation PubChem, PC Fluorescence-based biochemical high throughput dose response assay for activators of the calcium sensitivity of cardiac Regulated Thin Filaments (RTF) PubChem Bioassay(2011)[AID]
 
Tropomyosin alpha-1 chain
Name:Tropomyosin alpha-1 chain
Type:Enzyme Catalytic Domain
Mol. Mass.:32681.01
Organism:Sus scrofa
Description:P42639
Residue:284
BDBM43688
NameBDBM43688
Synonyms:(E)-2-(1H-Benzoimidazol-2-yl)-3-(5-morpholin-4-yl-furan-2-yl)-acrylonitrile (E)-2-(1H-benzimidazol-2-yl)-3-(5-morpholino-2-furyl)acrylonitrile MLS000552736 cid_5914490
TypeSmall organic molecule
Emp. Form.C18H16N4O2
Mol. Mass.320.3452
SMILESN#C\C(=C/c1ccc(o1)N1CCOCC1)c1nc2ccccc2[nH]1