Reaction Details
TargetTropomyosin alpha-1 chain
LigandBDBM47577
Substrate/Competitorn/a
Meas. Tech.Fluorescence-based biochemical high throughput dose response assay for activators of the calcium sensitivity of cardiac Regulated Thin Filaments (RTF)
EC50 2706±n/a nM
Citation PubChem, PC Fluorescence-based biochemical high throughput dose response assay for activators of the calcium sensitivity of cardiac Regulated Thin Filaments (RTF) PubChem Bioassay(2011)[AID]
 
Tropomyosin alpha-1 chain
Name:Tropomyosin alpha-1 chain
Type:Enzyme Catalytic Domain
Mol. Mass.:32681.01
Organism:Sus scrofa
Description:P42639
Residue:284
BDBM47577
NameBDBM47577
Synonyms:(5Z)-3-ethyl-2-sulfanylidene-5-[(1,2,5-trimethyl-3-pyrrolyl)methylidene]-4-thiazolidinone (5Z)-3-ethyl-2-thioxo-5-[(1,2,5-trimethylpyrrol-3-yl)methylene]thiazolidin-4-one MLS000576648 cid_2584707
TypeSmall organic molecule
Emp. Form.C13H16N2OS2
Mol. Mass.280.409
SMILESCCN1C(=S)S\C(=C/c2cc(C)n(C)c2C)C1=O