Reaction Details
TargetTropomyosin alpha-1 chain
LigandBDBM51048
Substrate/Competitorn/a
Meas. Tech.Fluorescence-based biochemical high throughput dose response assay for activators of the calcium sensitivity of cardiac Regulated Thin Filaments (RTF)
EC50 1113±n/a nM
Citation PubChem, PC Fluorescence-based biochemical high throughput dose response assay for activators of the calcium sensitivity of cardiac Regulated Thin Filaments (RTF) PubChem Bioassay(2011)[AID]
 
Tropomyosin alpha-1 chain
Name:Tropomyosin alpha-1 chain
Type:Enzyme Catalytic Domain
Mol. Mass.:32681.01
Organism:Sus scrofa
Description:P42639
Residue:284
BDBM51048
NameBDBM51048
Synonyms:2,4-dichlorobenzoic acid 2-(1,3-diketo-6-morpholino-benzo[de]isoquinolin-2-yl)ethyl ester 2-(6-morpholin-4-yl-1,3-dioxobenzo[de]isoquinolin-2-yl)ethyl 2,4-dichlorobenzoate MLS000722249 cid_4620544
TypeSmall organic molecule
Emp. Form.C25H20Cl2N2O5
Mol. Mass.499.343
SMILESClc1ccc(C(=O)OCCN2C(=O)c3cccc4c(ccc(C2=O)c34)N2CCOCC2)c(Cl)c1