Reaction Details
TargetTropomyosin alpha-1 chain
LigandBDBM79705
Substrate/Competitorn/a
Meas. Tech.Fluorescence-based biochemical high throughput dose response assay for activators of the calcium sensitivity of cardiac Regulated Thin Filaments (RTF)
EC50>71500±n/a nM
Citation PubChem, PC Fluorescence-based biochemical high throughput dose response assay for activators of the calcium sensitivity of cardiac Regulated Thin Filaments (RTF) PubChem Bioassay(2011)[AID]
 
Tropomyosin alpha-1 chain
Name:Tropomyosin alpha-1 chain
Type:Enzyme Catalytic Domain
Mol. Mass.:32681.01
Organism:Sus scrofa
Description:P42639
Residue:284
BDBM79705
NameBDBM79705
Synonyms:2-(4-{[1-(5-chloropyridin-2-yl)-1H-pyrrol-2-yl]methyl}-1-isobutylpiperazin-2-yl)ethanol 2-[4-[[1-(5-chloro-2-pyridinyl)-2-pyrrolyl]methyl]-1-(2-methylpropyl)-2-piperazinyl]ethanol 2-[4-[[1-(5-chloropyridin-2-yl)pyrrol-2-yl]methyl]-1-(2-methylpropyl)piperazin-2-yl]ethanol SMR000315885 | cid_16187269
TypeSmall organic molecule
Emp. Form.C20H29ClN4O
Mol. Mass.376.923
SMILESCC(C)CN1CCN(Cc2cccn2-c2ccc(Cl)cn2)CC1CCO