Reaction Details
TargetTropomyosin alpha-1 chain
LigandBDBM51177
Substrate/Competitorn/a
Meas. Tech.Fluorescence-based biochemical high throughput dose response assay for activators of the calcium sensitivity of cardiac Regulated Thin Filaments (RTF)
EC50 4162±n/a nM
Citation PubChem, PC Fluorescence-based biochemical high throughput dose response assay for activators of the calcium sensitivity of cardiac Regulated Thin Filaments (RTF) PubChem Bioassay(2011)[AID]
 
Tropomyosin alpha-1 chain
Name:Tropomyosin alpha-1 chain
Type:Enzyme Catalytic Domain
Mol. Mass.:32681.01
Organism:Sus scrofa
Description:P42639
Residue:284
BDBM51177
NameBDBM51177
Synonyms:2-(2-methyl-4-pyrrolidino-benzylidene)malononitrile 2-[(2-methyl-4-pyrrolidin-1-ylphenyl)methylidene]propanedinitrile MLS000706384 cid_963286
TypeSmall organic molecule
Emp. Form.C15H15N3
Mol. Mass.237.2997
SMILES[#6]-c1cc(ccc1\[#6]=[#6](\C#N)C#N)-[#7]-1-[#6]-[#6]-[#6]-[#6]-1