Reaction Details
TargetTropomyosin alpha-1 chain
LigandBDBM79757
Substrate/Competitorn/a
Meas. Tech.Fluorescence-based biochemical high throughput dose response assay for activators of the calcium sensitivity of cardiac Regulated Thin Filaments (RTF)
EC50 3326±n/a nM
Citation PubChem, PC Fluorescence-based biochemical high throughput dose response assay for activators of the calcium sensitivity of cardiac Regulated Thin Filaments (RTF) PubChem Bioassay(2011)[AID]
 
Tropomyosin alpha-1 chain
Name:Tropomyosin alpha-1 chain
Type:Enzyme Catalytic Domain
Mol. Mass.:32681.01
Organism:Sus scrofa
Description:P42639
Residue:284
BDBM79757
NameBDBM79757
Synonyms:1,1,7,7-tetramethyl-2,3,6,7-tetrahydro-1H,5H-pyrido[3,2,1-ij]quinolin-8-ol methanesulfonate (salt) SMR000496899 | cid_2886102
TypeSmall organic molecule
Emp. Form.C17H27NO4S
Mol. Mass.341.466
SMILESCS(O)(=O)=O.CC1(C)CCN2CCC(C)(C)c3c(O)ccc1c23