Reaction Details
TargetTropomyosin alpha-1 chain
LigandBDBM53358
Substrate/Competitorn/a
Meas. Tech.Fluorescence-based biochemical high throughput dose response assay for activators of the calcium sensitivity of cardiac Regulated Thin Filaments (RTF)
EC50 278.85±n/a nM
Citation PubChem, PC Fluorescence-based biochemical high throughput dose response assay for activators of the calcium sensitivity of cardiac Regulated Thin Filaments (RTF) PubChem Bioassay(2011)[AID]
 
Tropomyosin alpha-1 chain
Name:Tropomyosin alpha-1 chain
Type:Enzyme Catalytic Domain
Mol. Mass.:32681.01
Organism:Sus scrofa
Description:P42639
Residue:284
BDBM53358
NameBDBM53358
Synonyms:3-(furan-2-carbonyl)-4-hydroxy-2-(4-methylsulfanylphenyl)-1-(5-methylsulfanyl-1,3,4-thiadiazol-2-yl)-2H-pyrrol-5-one 3-[2-furanyl(oxo)methyl]-4-hydroxy-2-[4-(methylthio)phenyl]-1-[5-(methylthio)-1,3,4-thiadiazol-2-yl]-2H-pyrrol-5-one MLS001140617 cid_4905842
TypeSmall organic molecule
Emp. Form.C19H15N3O4S3
Mol. Mass.445.535
SMILESCSc1nnc(s1)N1C(C(C(=O)c2ccco2)C(=O)C1=O)c1ccc(SC)cc1