Reaction Details
TargetOrexin/Hypocretin receptor type 1
LigandBDBM38923
Substrate/Competitorn/a
Meas. Tech.Fluorescence-based cell-based high throughput dose response assay for antagonists of the orexin 1 receptor (OX1R; HCRTR1)
IC50 9489±n/a nM
Citation PubChem, PC Fluorescence-based cell-based high throughput dose response assay for antagonists of the orexin 1 receptor (OX1R; HCRTR1) PubChem Bioassay(2011)[AID]
 
Orexin/Hypocretin receptor type 1
Name:Orexin/Hypocretin receptor type 1
Type:Protein
Mol. Mass.:47554.50
Organism:Homo sapiens (Human)
Description:O43613
Residue:425
BDBM38923
NameBDBM38923
Synonyms:(2-oxidanylideneoxolan-3-yl) 5-(1,3-benzothiazol-2-yl)thiophene-2-carboxylate 5-(1,3-benzothiazol-2-yl)-2-thiophenecarboxylic acid (2-oxo-3-oxolanyl) ester MLS000096514 cid_2997660
TypeSmall organic molecule
Emp. Form.C16H11NO4S2
Mol. Mass.345.393
SMILESO=C(OC1CCOC1=O)c1ccc(s1)-c1nc2ccccc2s1