Reaction Details
TargetBeta-galactosidase
LigandBDBM48027
Substrate/Competitorn/a
Meas. Tech.HTS Dose response counterscreen for assays utilizing the enzyme, beta-galactosidase - Set 3
IC50 36100±4693 nM
Citation PubChem, PC HTS Dose response counterscreen for assays utilizing the enzyme, beta-galactosidase - Set 3 PubChem Bioassay(2011)[AID]
 
Beta-galactosidase
Name:Beta-galactosidase
Type:PROTEIN
Mol. Mass.:116943.87
Organism:Escherichia coli
Description:ChEMBL_215882
Residue:1029
BDBM48027
NameBDBM48027
Synonyms:4-[[(4E)-1-keto-4-mesitylsulfonylimino-2-naphthyl]amino]benzoic acid 4-[[(4E)-1-oxo-4-(2,4,6-trimethylphenyl)sulfonylimino-2-naphthalenyl]amino]benzoic acid MLS000948031 cid_9609431
TypeSmall organic molecule
Emp. Form.C26H22N2O5S
Mol. Mass.474.528
SMILESCc1cc(C)c(c(C)c1)S(=O)(=O)N=C1C=C(Nc2ccc(cc2)C(O)=O)C(=O)c2ccccc12