Reaction Details
TargetDNA dC->dU-editing enzyme APOBEC-3A
LigandBDBM80143
Substrate/Competitorn/a
Meas. Tech.Dose Response confirmation of APOBEC3G DNA Deaminase Inhibitors via a A3A counterscreen
Temperature298.15±n/a K
IC50>100000±n/a nM
Commentsextracted
Citation PubChem, PC Dose Response confirmation of APOBEC3G DNA Deaminase Inhibitors via a A3A counterscreen PubChem Bioassay(2011)[AID]
 
DNA dC->dU-editing enzyme APOBEC-3A
Name:DNA dC->dU-editing enzyme APOBEC-3A
Type:Enzyme Catalytic Domain
Mol. Mass.:23013.77
Organism:Homo sapiens (Human)
Description:gi_21955158
Residue:199
BDBM80143
NameBDBM80143
Synonyms:4-methyl-3-[1-methyl-3-(trifluoromethyl)-5-thieno[2,3-c]pyrazolyl]-1H-1,2,4-triazole-5-thione 4-methyl-5-[1-methyl-3-(trifluoromethyl)-1H-thieno[2,3-c]pyrazol-5-yl]-4H-1,2,4-triazole-3-thiol SMR000179140 | cid_2775440
TypeSmall organic molecule
Emp. Form.C10H8F3N5S2
Mol. Mass.319.329
SMILESCn1nc(c2cc(sc12)-c1n[nH]c(=S)n1C)C(F)(F)F