Reaction Details
TargetDNA dC->dU-editing enzyme APOBEC-3A
LigandBDBM80156
Substrate/Competitorn/a
Meas. Tech.Dose Response confirmation of APOBEC3G DNA Deaminase Inhibitors via a A3A counterscreen
Temperature298.15±n/a K
IC50>100000±n/a nM
Commentsextracted
Citation PubChem, PC Dose Response confirmation of APOBEC3G DNA Deaminase Inhibitors via a A3A counterscreen PubChem Bioassay(2011)[AID]
 
DNA dC->dU-editing enzyme APOBEC-3A
Name:DNA dC->dU-editing enzyme APOBEC-3A
Type:Enzyme Catalytic Domain
Mol. Mass.:23013.77
Organism:Homo sapiens (Human)
Description:gi_21955158
Residue:199
BDBM80156
NameBDBM80156
Synonyms:4-[(1-methyl-2-pyrrolyl)methylideneamino]-3-phenyl-1H-1,2,4-triazole-5-thione 4-[(1-methylpyrrol-2-yl)methylideneamino]-3-phenyl-1H-1,2,4-triazole-5-thione MLS000573320 cid_668477
TypeSmall organic molecule
Emp. Form.C14H13N5S
Mol. Mass.283.352
SMILESCn1cccc1C=Nn1c(n[nH]c1=S)-c1ccccc1