Reaction Details
TargetDNA dC->dU-editing enzyme APOBEC-3A
LigandBDBM65990
Substrate/Competitorn/a
Meas. Tech.Dose Response confirmation of APOBEC3G DNA Deaminase Inhibitors via a A3A counterscreen
Temperature298.15±n/a K
IC50>100000±n/a nM
Commentsextracted
Citation PubChem, PC Dose Response confirmation of APOBEC3G DNA Deaminase Inhibitors via a A3A counterscreen PubChem Bioassay(2011)[AID]
 
DNA dC->dU-editing enzyme APOBEC-3A
Name:DNA dC->dU-editing enzyme APOBEC-3A
Type:Enzyme Catalytic Domain
Mol. Mass.:23013.77
Organism:Homo sapiens (Human)
Description:gi_21955158
Residue:199
BDBM65990
NameBDBM65990
Synonyms:3-[2,5-bis(oxidanylidene)pyrrol-1-yl]-N-(2,4-dichlorophenyl)benzamide N-(2,4-dichlorophenyl)-3-(2,5-dioxo-1-pyrrolyl)benzamide N-(2,4-dichlorophenyl)-3-(2,5-dioxopyrrol-1-yl)benzamide SMR000194626 | cid_2275069
TypeSmall organic molecule
Emp. Form.C17H10Cl2N2O3
Mol. Mass.361.179
SMILESClc1ccc(NC(=O)c2cccc(c2)N2C(=O)C=CC2=O)c(Cl)c1