Reaction Details
TargetDNA dC->dU-editing enzyme APOBEC-3G
LigandBDBM80537
Substrate/Competitorn/a
Meas. Tech.Dose Response confirmation of APOBEC3A DNA Deaminase Inhibitors via a A3G counterscreen
Temperature298.15±n/a K
IC50 1720±152 nM
Commentsextracted
Citation PubChem, PC Dose Response confirmation of APOBEC3A DNA Deaminase Inhibitors via a A3G counterscreen PubChem Bioassay(2011)[AID]
 
DNA dC->dU-editing enzyme APOBEC-3G
Name:DNA dC->dU-editing enzyme APOBEC-3G
Type:Enzyme Catalytic Domain
Mol. Mass.:46419.54
Organism:Homo sapiens (Human)
Description:gi_13399304
Residue:384
BDBM80537
NameBDBM80537
Synonyms:4-(2-Chloro-phenylcarbamoyl)-1-methyl-pyridinium N-(2-chlorophenyl)-1-methyl-4-pyridin-1-iumcarboxamide;iodide N-(2-chlorophenyl)-1-methylpyridin-1-ium-4-carboxamide;iodide cid_23724360
TypeSmall organic molecule
Emp. Form.C13H12ClN2O
Mol. Mass.247.7
SMILESC[n+]1ccc(cc1)C(=O)Nc1ccccc1Cl