Reaction Details
TargetDNA dC->dU-editing enzyme APOBEC-3A
LigandBDBM80377
Substrate/Competitorn/a
Meas. Tech.Dose Response confirmation of small molecule APOBEC3A DNA Deaminase Inhibitors via a fluorescence-based single-stranded DNA deaminase assay
Temperature298.15±n/a K
IC50 1640±n/a nM
Commentsextracted
Citation PubChem, PC Dose Response confirmation of small molecule APOBEC3A DNA Deaminase Inhibitors via a fluorescence-based single-stranded DNA deaminase assay PubChem Bioassay(2011)[AID]
 
DNA dC->dU-editing enzyme APOBEC-3A
Name:DNA dC->dU-editing enzyme APOBEC-3A
Type:Enzyme Catalytic Domain
Mol. Mass.:23013.77
Organism:Homo sapiens (Human)
Description:gi_21955158
Residue:199
BDBM80377
NameBDBM80377
Synonyms:2-chloro-N-piperonyl-5-(1,2,4-triazol-4-yl)benzamide N-(1,3-benzodioxol-5-ylmethyl)-2-chloranyl-5-(1,2,4-triazol-4-yl)benzamide N-(1,3-benzodioxol-5-ylmethyl)-2-chloro-5-(4H-1,2,4-triazol-4-yl)benzamide cid_1243763
TypeSmall organic molecule
Emp. Form.C17H13ClN4O3
Mol. Mass.356.763
SMILESClc1ccc(cc1C(=O)NCc1ccc2OCOc2c1)-n1cnnc1