Reaction Details
TargetDNA dC->dU-editing enzyme APOBEC-3A
LigandBDBM80405
Substrate/Competitorn/a
Meas. Tech.Dose Response confirmation of small molecule APOBEC3A DNA Deaminase Inhibitors via a fluorescence-based single-stranded DNA deaminase assay
Temperature298.15±n/a K
IC50 1660±n/a nM
Commentsextracted
Citation PubChem, PC Dose Response confirmation of small molecule APOBEC3A DNA Deaminase Inhibitors via a fluorescence-based single-stranded DNA deaminase assay PubChem Bioassay(2011)[AID]
 
DNA dC->dU-editing enzyme APOBEC-3A
Name:DNA dC->dU-editing enzyme APOBEC-3A
Type:Enzyme Catalytic Domain
Mol. Mass.:23013.77
Organism:Homo sapiens (Human)
Description:gi_21955158
Residue:199
BDBM80405
NameBDBM80405
Synonyms:1-methyl-3-phenyl-6,7,8,9-tetrahydro-5H-imidaz[1,2-a]azepin-1-ium;iodide MLS000565397 cid_9551989
TypeSmall organic molecule
Emp. Form.C15H19N2
Mol. Mass.227.3242
SMILESC[n+]1cc(-c2ccccc2)n2CCCCCc12