Reaction Details
TargetDNA dC->dU-editing enzyme APOBEC-3A
LigandBDBM80420
Substrate/Competitorn/a
Meas. Tech.Dose Response confirmation of small molecule APOBEC3A DNA Deaminase Inhibitors via a fluorescence-based single-stranded DNA deaminase assay
Temperature298.15±n/a K
IC50 1580±n/a nM
Commentsextracted
Citation PubChem, PC Dose Response confirmation of small molecule APOBEC3A DNA Deaminase Inhibitors via a fluorescence-based single-stranded DNA deaminase assay PubChem Bioassay(2011)[AID]
 
DNA dC->dU-editing enzyme APOBEC-3A
Name:DNA dC->dU-editing enzyme APOBEC-3A
Type:Enzyme Catalytic Domain
Mol. Mass.:23013.77
Organism:Homo sapiens (Human)
Description:gi_21955158
Residue:199
BDBM80420
NameBDBM80420
Synonyms:MLS000583669 N-[3-(1,3-benzothiazol-2-yl)-2-methylphenyl]-1H-1,2,4-triazole-3-carboxamide SMR000198590 | cid_709602
TypeSmall organic molecule
Emp. Form.C17H13N5OS
Mol. Mass.335.383
SMILESCc1c(NC(=O)c2nnc[nH]2)cccc1-c1nc2ccccc2s1