Reaction Details
TargetDNA dC->dU-editing enzyme APOBEC-3A
LigandBDBM80556
Substrate/Competitorn/a
Meas. Tech.Dose Response confirmation of small molecule APOBEC3A DNA Deaminase Inhibitors via a fluorescence-based single-stranded DNA deaminase assay
Temperature298.15±n/a K
IC50 1750±n/a nM
Commentsextracted
Citation PubChem, PC Dose Response confirmation of small molecule APOBEC3A DNA Deaminase Inhibitors via a fluorescence-based single-stranded DNA deaminase assay PubChem Bioassay(2011)[AID]
 
DNA dC->dU-editing enzyme APOBEC-3A
Name:DNA dC->dU-editing enzyme APOBEC-3A
Type:Enzyme Catalytic Domain
Mol. Mass.:23013.77
Organism:Homo sapiens (Human)
Description:gi_21955158
Residue:199
BDBM80556
NameBDBM80556
Synonyms:4-[[4-[(Z)-2-cyano-3-oxidanylidene-3-phenylazanyl-prop-1-enyl]phenoxy]methyl]benzoic acid 4-[[4-[(Z)-3-anilino-2-cyano-3-oxoprop-1-enyl]phenoxy]methyl]benzoic acid SMR000538783 | cid_1924058
TypeSmall organic molecule
Emp. Form.C24H18N2O4
Mol. Mass.398.4107
SMILESOC(=O)c1ccc(COc2ccc(\C=C(\C#N)C(=O)Nc3ccccc3)cc2)cc1