Reaction Details
TargetDNA dC->dU-editing enzyme APOBEC-3A
LigandBDBM80613
Substrate/Competitorn/a
Meas. Tech.Dose Response confirmation of small molecule APOBEC3A DNA Deaminase Inhibitors via a fluorescence-based single-stranded DNA deaminase assay
Temperature298.15±n/a K
IC50 8260±n/a nM
Commentsextracted
Citation PubChem, PC Dose Response confirmation of small molecule APOBEC3A DNA Deaminase Inhibitors via a fluorescence-based single-stranded DNA deaminase assay PubChem Bioassay(2011)[AID]
 
DNA dC->dU-editing enzyme APOBEC-3A
Name:DNA dC->dU-editing enzyme APOBEC-3A
Type:Enzyme Catalytic Domain
Mol. Mass.:23013.77
Organism:Homo sapiens (Human)
Description:gi_21955158
Residue:199
BDBM80613
NameBDBM80613
Synonyms:1-(2,3,4-Trimethoxy-benzyl)-piperazine 1-[(2,3,4-trimethoxyphenyl)methyl]piperazine;hydrochloride SMR000674573 cid_9926449
TypeSmall organic molecule
Emp. Form.C14H22N2O3
Mol. Mass.266.3361
SMILESCOc1ccc(CN2CCNCC2)c(OC)c1OC