Reaction Details
TargetC-C chemokine receptor type 6
LigandBDBM79971
Substrate/Competitorn/a
Meas. Tech.Dose Response confirmation of small molecule antagonists of the CCR6 receptor: a luminescent beta-arrestin assay
IC50 15500±n/a nM
Citation PubChem, PC Dose Response confirmation of small molecule antagonists of the CCR6 receptor: a luminescent beta-arrestin assay PubChem Bioassay(2011)[AID]
 
C-C chemokine receptor type 6
Name:C-C chemokine receptor type 6
Type:Enzyme
Mol. Mass.:42510.84
Organism:Homo sapiens (Human)
Description:P51684
Residue:374
BDBM79971
NameBDBM79971
Synonyms:2-(1-Butyryl-2,2-dimethyl-3-thioxo-2,3-dihydro-1H-quinolin-4-ylidene)-[1,3]dithiole-4,5-dicarboxylic acid dimethyl ester 2-[2,2-dimethyl-1-(1-oxobutyl)-3-sulfanylidene-4-quinolinylidene]-1,3-dithiole-4,5-dicarboxylic acid dimethyl ester SMR000118274 dimethyl 2-(1-butanoyl-2,2-dimethyl-3-sulfanylidene-quinolin-4-ylidene)-1,3-dithiole-4,5-dicarboxylate | dimethyl 2-(1-butanoyl-2,2-dimethyl-3-sulfanylidenequinolin-4-ylidene)-1,3-dithiole-4,5-dicarboxylate
TypeSmall organic molecule
Emp. Form.C22H23NO5S3
Mol. Mass.477.617
SMILES[#6]-[#6]-[#6]-[#6](=O)-[#7]1-c2ccccc2\[#6](=[#6]-2\[#16]-[#6](-[#6](=O)-[#8]-[#6])=[#6](-[#16]-2)-[#6](=O)-[#8]-[#6])-[#6](=S)C1([#6])[#6]