Reaction Details
TargetC-C chemokine receptor type 6
LigandBDBM64560
Substrate/Competitorn/a
Meas. Tech.Dose Response confirmation of small molecule antagonists of the CCR6 receptor: a luminescent beta-arrestin assay
IC50 15800±n/a nM
Citation PubChem, PC Dose Response confirmation of small molecule antagonists of the CCR6 receptor: a luminescent beta-arrestin assay PubChem Bioassay(2011)[AID]
 
C-C chemokine receptor type 6
Name:C-C chemokine receptor type 6
Type:Enzyme
Mol. Mass.:42510.84
Organism:Homo sapiens (Human)
Description:P51684
Residue:374
BDBM64560
NameBDBM64560
Synonyms:(5,7-dichloroquinolin-8-yl) furan-2-carboxylate Furan-2-carboxylic acid 5,7-dichloro-quinolin-8-yl ester SMR000116952 cid_686057 | furan-2-carboxylic acid (5,7-dichloro-8-quinolyl) ester
TypeSmall organic molecule
Emp. Form.C14H7Cl2NO3
Mol. Mass.308.116
SMILESClc1cc(Cl)c2cccnc2c1OC(=O)c1ccco1