Reaction Details
TargetC-C chemokine receptor type 6
LigandBDBM49662
Substrate/Competitorn/a
Meas. Tech.Dose Response confirmation of small molecule antagonists of the CCR6 receptor: a luminescent beta-arrestin assay
IC50 552±n/a nM
Citation PubChem, PC Dose Response confirmation of small molecule antagonists of the CCR6 receptor: a luminescent beta-arrestin assay PubChem Bioassay(2011)[AID]
 
C-C chemokine receptor type 6
Name:C-C chemokine receptor type 6
Type:Enzyme
Mol. Mass.:42510.84
Organism:Homo sapiens (Human)
Description:P51684
Residue:374
BDBM49662
NameBDBM49662
Synonyms:MLS000335562 N-(1H-benzimidazol-2-yl)-3-methyl-2-benzofurancarboxamide SMR000253316 | cid_2117785
TypeSmall organic molecule
Emp. Form.C17H13N3O2
Mol. Mass.291.304
SMILESCc1c(oc2ccccc12)C(=O)Nc1nc2ccccc2[nH]1