Reaction Details
TargetC-C chemokine receptor type 6
LigandBDBM65447
Substrate/Competitorn/a
Meas. Tech.Dose Response confirmation of small molecule antagonists of the CCR6 receptor: a luminescent beta-arrestin assay
IC50 1640±n/a nM
Citation PubChem, PC Dose Response confirmation of small molecule antagonists of the CCR6 receptor: a luminescent beta-arrestin assay PubChem Bioassay(2011)[AID]
 
C-C chemokine receptor type 6
Name:C-C chemokine receptor type 6
Type:Enzyme
Mol. Mass.:42510.84
Organism:Homo sapiens (Human)
Description:P51684
Residue:374
BDBM65447
NameBDBM65447
Synonyms:(6E)-2-methoxy-6-[[2-[4-(4-nitroanilino)-6-pyrrolidin-1-yl-1,3,5-triazin-2-yl]hydrazinyl]methylidene]cyclohexa-2,4-dien-1-one (6E)-2-methoxy-6-[[N'-[4-(4-nitroanilino)-6-pyrrolidino-s-triazin-2-yl]hydrazino]methylene]cyclohexa-2,4-dien-1-one 2-hydroxy-3-methoxybenzaldehyde {4-[(4-nitrophenyl)amino]-6-pyrrolidin-1-yl-1,3,5-triazin-2-yl}hydrazone SMR000313400 | cid_6065647
TypeSmall organic molecule
Emp. Form.C21H22N8O4
Mol. Mass.450.4506
SMILESCOc1ccc[c-](C[NH+]=Nc2nc(Nc3ccc(cc3)[N+]([O-])=O)nc(n2)N2CCCC2)c1=O