Reaction Details
TargetC-C chemokine receptor type 6
LigandBDBM80065
Substrate/Competitorn/a
Meas. Tech.Dose Response confirmation of small molecule antagonists of the CCR6 receptor: a luminescent beta-arrestin assay
IC50 13100±n/a nM
Citation PubChem, PC Dose Response confirmation of small molecule antagonists of the CCR6 receptor: a luminescent beta-arrestin assay PubChem Bioassay(2011)[AID]
 
C-C chemokine receptor type 6
Name:C-C chemokine receptor type 6
Type:Enzyme
Mol. Mass.:42510.84
Organism:Homo sapiens (Human)
Description:P51684
Residue:374
BDBM80065
NameBDBM80065
Synonyms:1-(3,5-dimethylphenyl)-3-pyrroline-2,5-quinone MLS002667608 cid_243574
TypeSmall organic molecule
Emp. Form.C12H11NO2
Mol. Mass.201.2212
SMILESCc1cc(C)cc(c1)N1C(=O)C=CC1=O