Reaction Details
TargetHexokinase HKDC1 [W721R]
LigandBDBM75323
Substrate/Competitorn/a
Meas. Tech.Dose Response confirmation of inhibitors of hexokinase domain containing I (HKDC1)
IC50 33000±n/a nM
Citation PubChem, PC Dose Response confirmation of inhibitors of hexokinase domain containing I (HKDC1) PubChem Bioassay(2011)[AID]
 
Hexokinase HKDC1 [W721R]
Name:Hexokinase HKDC1 [W721R]
Type:Enzyme Catalytic Domain
Mol. Mass.:102520.24
Organism:Homo sapiens (Human)
Description:gi_156151420
Residue:917
BDBM75323
NameBDBM75323
Synonyms:2-[4-[[[4-[2-(4-chloroanilino)-1,3-thiazol-4-yl]benzoyl]hydrazinylidene]methyl]phenoxy]acetic acid 2-[4-[[[4-[2-[(4-chlorophenyl)amino]-1,3-thiazol-4-yl]phenyl]carbonylhydrazinylidene]methyl]phenoxy]ethanoic acid MLS000703184 cid_3143384
TypeSmall organic molecule
Emp. Form.C25H19ClN4O4S
Mol. Mass.506.961
SMILESOC(=O)COc1ccc(C=NNC(=O)c2ccc(cc2)-c2csc(Nc3ccc(Cl)cc3)n2)cc1