Reaction Details
TargetHexokinase HKDC1 [W721R]
LigandBDBM34233
Substrate/Competitorn/a
Meas. Tech.Dose Response confirmation of activators of hexokinase domain containing I (HKDC1)
EC50 38800±n/a nM
Citation PubChem, PC Dose Response confirmation of activators of hexokinase domain containing I (HKDC1) PubChem Bioassay(2011)[AID]
 
Hexokinase HKDC1 [W721R]
Name:Hexokinase HKDC1 [W721R]
Type:Enzyme Catalytic Domain
Mol. Mass.:102520.24
Organism:Homo sapiens (Human)
Description:gi_156151420
Residue:917
BDBM34233
NameBDBM34233
Synonyms:2-Phenyl-benzo[d]isoselenazol-3-one 2-phenyl-1,2-benzisoselazol-3(2H)-one 2-phenylbenzo[d][1,2]selenazol-3(2H)-one EBSELEN MLS000028488 cid_3194 | med.21724, Compound 153
TypeSmall organic molecule
Emp. Form.C13H9NOSe
Mol. Mass.274.18
SMILESO=c1n([se]c2ccccc12)-c1ccccc1