Reaction Details
TargetTropomyosin alpha-1 chain
LigandBDBM31713
Substrate/Competitorn/a
Meas. Tech.Fluorescence-based biochemical high throughput dose response assay for inhibitors of the calcium sensitivity of cardiac Regulated Thin Filaments (RTF)
IC50 47480±n/a nM
Citation PubChem, PC Fluorescence-based biochemical high throughput dose response assay for inhibitors of the calcium sensitivity of cardiac Regulated Thin Filaments (RTF) PubChem Bioassay(2011)[AID]
 
Tropomyosin alpha-1 chain
Name:Tropomyosin alpha-1 chain
Type:Enzyme Catalytic Domain
Mol. Mass.:32681.01
Organism:Sus scrofa
Description:P42639
Residue:284
BDBM31713
NameBDBM31713
Synonyms:1-Cyclopropyl-3-(2,3-di-furan-2-yl-quinoxalin-6-yl)-urea 1-[2,3-bis(2-furyl)quinoxalin-6-yl]-3-cyclopropyl-urea 1-[2,3-bis(furan-2-yl)quinoxalin-6-yl]-3-cyclopropylurea SMR000118524 | cid_1072898
TypeSmall organic molecule
Emp. Form.C20H16N4O3
Mol. Mass.360.366
SMILESO=C(NC1CC1)Nc1ccc2nc(-c3ccco3)c(nc2c1)-c1ccco1