Reaction Details
TargetTropomyosin alpha-1 chain
LigandBDBM31715
Substrate/Competitorn/a
Meas. Tech.Fluorescence-based biochemical high throughput dose response assay for inhibitors of the calcium sensitivity of cardiac Regulated Thin Filaments (RTF)
IC50 14960±n/a nM
Citation PubChem, PC Fluorescence-based biochemical high throughput dose response assay for inhibitors of the calcium sensitivity of cardiac Regulated Thin Filaments (RTF) PubChem Bioassay(2011)[AID]
 
Tropomyosin alpha-1 chain
Name:Tropomyosin alpha-1 chain
Type:Enzyme Catalytic Domain
Mol. Mass.:32681.01
Organism:Sus scrofa
Description:P42639
Residue:284
BDBM31715
NameBDBM31715
Synonyms:3-[(4Z)-4-[(E)-3-(2-furanyl)prop-2-enylidene]-3-methyl-5-oxo-1-pyrazolyl]benzoic acid 3-[(4Z)-4-[(E)-3-(furan-2-yl)prop-2-enylidene]-3-methyl-5-oxidanylidene-pyrazol-1-yl]benzoic acid 3-{4-[3-(2-furyl)-2-propenylidene]-3-methyl-5-oxo-4,5-dihydro-1H-pyrazol-1-yl}benzoic acid SMR000113614 | cid_9549698
TypeSmall organic molecule
Emp. Form.C18H14N2O4
Mol. Mass.322.3148
SMILESOC(=O)c1cccc(c1)-n1[nH]c(=C)c(=CC=Cc2ccco2)c1=O